Target
Tyrosine-protein kinase JAK3
Ligand
BDBM305831
Substrate
Meas. Tech.
JAK Caliper Enzyme Assay at 1 mM ATP
IC50
>10000±n/a nM
Citation
 Brown, MFDermenci, AFensome, AGerstenberger, BSHayward, MMOwen, DRWright, SWXing, LHYang, X Pyrazolo[1,5-a]pyrazin-4-yl derivatives US Patent  US11472809 Publication Date 10/18/2022 
Target
Name:
Tyrosine-protein kinase JAK3
Synonyms:
JAK-3 JAK3_HUMAN Janus kinase 3 (JAK3) L-JAK | Leukocyte janus kinase
Type:
Protein
Mol. Mass.:
125111.08
Organism:
Homo sapiens (Human)
Description:
P52333
Residue:
1124
  
Inhibitor
Name:
BDBM305831
Synonyms:
2-((1r,3s)-1-(4-(6-(3-Amino-1H-pyrazol-5-yl)pyrazolo[1,5-a]pyrazin-4-yl)-1H-pyrazol-1-yl)-3-methoxycyclobutyl)acetonitrile US10822341, Example 30 | US11472809, Example 30
Type:
Small organic molecule
Emp. Form.:
C19H19N9O
Mol. Mass.:
389.4139
SMILES:
CO[C@H]1C[C@@](CC#N)(C1)n1cc(cn1)-c1nc(cn2nccc12)-c1cc(N)[nH]n1
: