Target
Vascular endothelial growth factor receptor 2
Ligand
BDBM8829
Substrate
biotinylated synthetic peptide
Meas. Tech.
Homogeneous Time-resolved Fluorescence (HTRF) Assay
IC50
260±n/a nM
Citation
 Dai, YGuo, YFrey, RRJi, ZCurtin, MLAhmed, AAAlbert, DHArnold, LArries, SSBarlozzari, TBauch, JLBouska, JJBousquet, PFCunha, GAGlaser, KBGuo, JLi, JMarcotte, PAMarsh, KCMoskey, MDPease, LJStewart, KDStoll, VSTapang, PWishart, NDavidsen, SKMichaelides, MR Thienopyrimidine ureas as novel and potent multitargeted receptor tyrosine kinase inhibitors. J Med Chem 48:6066-83 (2005)  
Target
Name:
Vascular endothelial growth factor receptor 2
Synonyms:
CD_antigen=CD309 Fetal liver kinase 1 (FLK-1) KDR Protein-tyrosine kinase receptor Flk-1 VEGFR-2 VEGFR2 Vascular Endothelial Growth Factor Receptor Kinase 2 Vascular endothelial growth factor receptor 2 (KDR) Vascular endothelial growth factor receptor 2 (VEGFR2) Vascular endothelial growth factor receptor-2 (VEGFR-2)
Type:
Receptor Tyrosine Kinase
Mol. Mass.:
151510.97
Organism:
Homo sapiens (Human)
Description:
P35968
Residue:
1356
  
Inhibitor
Name:
BDBM8829
Synonyms:
3-(4-{4-amino-6-methylthieno[2,3-d]pyrimidin-5-yl}phenyl)-1-(2-methylphenyl)urea Thienopyrimidine deriv. 10
Type:
Small organic molecule
Emp. Form.:
C21H19N5OS
Mol. Mass.:
389.473
SMILES:
Cc1sc2ncnc(N)c2c1-c1ccc(NC(=O)Nc2ccccc2C)cc1
:
Substrate
Name:
biotinylated synthetic peptide
Synonyms:
Type:
Peptide
Mol. Mass.:
2470.20
Organism:
Description:
Residue:
21