Target
hek293 luciferase
Ligand
BDBM50502723
Substrate
Meas. Tech.
HEK293 luciferase
EC50
18.0±n/a nM
Citation
 Bartholomeus, JBürli, RJarvis, RJohnstone, SOstenfeld, TTerstiege, ITravagli, MTurcotte, S Small molecule modulators of the BTB domain of Keap1 US Patent  US11479539 Publication Date 10/25/2022 
Target
Name:
Gag-Pol polyprotein [588-1147,M628L,D654N,M771V,L797W,T802Y]
Synonyms:
HIV RT (41L/67N/210W/215Y/184V) gag-pol
Type:
Mol. Mass.:
64571.45
Organism:
Human immunodeficiency virus type 1 group M subtype B (isolate HXB2)
Description:
P04585[588-1147,M628L,D654N,M771V,L797W,T802Y]
Residue:
560
  
Inhibitor
Name:
BDBM50502723
Synonyms:
CHEMBL4462699 | US11479539, Compound 196
Type:
Small organic molecule
Emp. Form.:
C16H13F3N2O2
Mol. Mass.:
322.2818
SMILES:
COC1(CC2(CC2)C(=O)C(=C1)C#N)c1ncc(F)cc1C(F)F
: