Target
Bromodomain-containing protein 4 [353-454]
Ligand
BDBM318458
Substrate
Meas. Tech.
BRD4 AlphaScreen Assay
IC50
<100±n/a nM
Citation
 Combs, APSparks, RBMaduskuie, Jr., TPRodgers, JD Tricyclic heterocycles as BET protein inhibitors US Patent  US11498926 Publication Date 11/15/2022 
Target
Name:
Bromodomain-containing protein 4 [353-454]
Synonyms:
BRD4 BRD4_HUMAN HUNK1
Type:
Enzyme Catalytic Domain
Mol. Mass.:
11972.81
Organism:
Homo sapiens (Human)
Description:
O60885[353-454]
Residue:
102
  
Inhibitor
Name:
BDBM318458
Synonyms:
7-(3,5-Dimethylisoxazol-4-yl)-5-methyl-4-phenyl-4,5-dihydroimidazo[1,5,4-de][1,4]benzoxazin-2(1H)-one US11498926, Example 3 | US9624241, Example 3
Type:
Small organic molecule
Emp. Form.:
C21H19N3O3
Mol. Mass.:
361.3939
SMILES:
CC1Oc2c(ccc3[nH]c(=O)n(C1c1ccccc1)c23)-c1c(C)noc1C
: