Target
Protein-arginine deiminase type-4
Ligand
BDBM584086
Substrate
Meas. Tech.
Rapid-Fire Mass Spectrum (RFMS) Assay
IC50
7.00±n/a nM
Citation
 Srivastava, ASCherney, RJNgu, K Indole and azaindole inhibitors of pad enzymes US Patent  US11524959 Publication Date 12/13/2022 
Target
Name:
Protein-arginine deiminase type-4
Synonyms:
PAD4 PADI4_HUMAN PDI5
Type:
Enzyme Catalytic Domain
Mol. Mass.:
74078.90
Organism:
Homo sapiens (Human)
Description:
gi_216548487
Residue:
663
  
Inhibitor
Name:
BDBM584086
Synonyms:
US11524959, Compound 978. | US11524959, Compound 979.
Type:
Small organic molecule
Emp. Form.:
C31H34F3N5O3
Mol. Mass.:
581.6286
SMILES:
COc1cc(cc2nc(-c3cc4ccc(cc4n3CC3CC3)C(C)(O)C(F)(F)F)n(C)c12)C(=O)N1CC2CCC1[C@@H]2N
: