Target
Glutaminyl-peptide cyclotransferase
Ligand
BDBM309918
Substrate
Meas. Tech.
Spectrophotometric Assay
IC50
220±n/a nM
Citation
 Buchholz, MHeiser, UNiestroj, AJSommer, R Inhibitors of glutaminyl cyclase US Patent  US9656991 Publication Date 5/23/2017 
Target
Name:
Glutaminyl-peptide cyclotransferase
Synonyms:
Glutaminyl Cyclase Glutaminyl-peptide cyclotransferase Glutaminyl-tRNA cyclotransferase QPCT | QPCT_HUMAN
Type:
Enzyme
Mol. Mass.:
40877.05
Organism:
Homo sapiens (Human)
Description:
Q16769
Residue:
361
  
Inhibitor
Name:
BDBM309918
Synonyms:
1-mesityl-3-(3-(5- methyl-1H-imidazol- 1-yl)propyl)thiourea | US9656991, 32
Type:
Small organic molecule
Emp. Form.:
C17H24N4S
Mol. Mass.:
316.464
SMILES:
Cc1cncn1CCCNC(=S)Nc1c(C)cc(C)cc1C
: