Target
ATR-interacting protein/Serine/threonine-protein kinase ATR
Ligand
BDBM268172
Substrate
Meas. Tech.
Binding Assay ATR (tracer A)
IC50
6.76±n/a nM
Citation
 Wortmann, LLücking, ULefranc, JBriem, HKoppitz, MEis, KVon Nussbaum, FBader, BWengner, AMSiemeister, GBone, WLienau, PGrudzinska-Goebel, JMoosmayer, DEberspächer, USchick, H 2-(morpholin-4-yl)-1,7-naphthyridines US Patent  US11529356 Publication Date 12/20/2022 
Target
Name:
ATR-interacting protein/Serine/threonine-protein kinase ATR
Synonyms:
ATR/ATRIP
Type:
Enzyme
Mol. Mass.:
Description:
Components:
This complex has 2 components.
Component 1
Name:
Serine/threonine-protein kinase ATR
Synonyms:
ATR Ataxia telangiectasia and Rad3-related protein (ATR) FRP1 | Serine-protein kinase ATR
Type:
Protein
Mol. Mass.:
301404.58
Organism:
Homo sapiens (Human)
Description:
Q13535
Residue:
2644
  
Component 2
Name:
ATR-interacting protein
Synonyms:
AGS1 ATR-interacting protein (ATRIP) ATRIP_HUMAN
Type:
Enzyme Catalytic Domain
Mol. Mass.:
85833.30
Organism:
Homo sapiens (Human)
Description:
Q8WXE1
Residue:
791
  
Inhibitor
Name:
BDBM268172
Synonyms:
US10772893, Example 204 US9549932, 204
Type:
Small organic molecule
Emp. Form.:
C21H25N5O3S
Mol. Mass.:
427.52
SMILES:
C[C@@H]1COCCN1c1cc(C2CCS(=O)(=O)CC2)c2ccnc(-c3ccn[nH]3)c2n1
: