Target
Histone deacetylase 1
Ligand
BDBM50507688
Substrate
Meas. Tech.
Enzymatic Assay
IC50
11160±n/a nM
Citation
 Chern, JYu, CLiu, JHo, YWu, CHuang, CHung, P Histone deacetylases (HDACs) inhibitors US Patent  US11535598 Publication Date 12/27/2022 
Target
Name:
Histone deacetylase 1
Synonyms:
Cereblon/Histone deacetylase 1 HDAC1 Histone deacetylase 1 (HDAC1) RPD3L1
Type:
Enzyme
Mol. Mass.:
55090.27
Organism:
Homo sapiens (Human)
Description:
Q13547
Residue:
482
  
Inhibitor
Name:
BDBM50507688
Synonyms:
CHEMBL4550214 | US11535598, Compound 5
Type:
Small organic molecule
Emp. Form.:
C24H21N3O4
Mol. Mass.:
415.4412
SMILES:
ONC(=O)c1ccc(Cn2c3ccccc3c(=O)n(CCc3ccccc3)c2=O)cc1
: