Target
Histone deacetylase 8
Ligand
BDBM50507688
Substrate
Meas. Tech.
Enzymatic Assay
IC50
376±n/a nM
Citation
 Chern, JYu, CLiu, JHo, YWu, CHuang, CHung, P Histone deacetylases (HDACs) inhibitors US Patent  US11535598 Publication Date 12/27/2022 
Target
Name:
Histone deacetylase 8
Synonyms:
HD8 HDAC8_HUMAN Histone deacetylase 8 (HDAC-8) | Human HDAC8
Type:
Enzyme
Mol. Mass.:
41749.60
Organism:
Homo sapiens (Human)
Description:
Q9BY41
Residue:
377
  
Inhibitor
Name:
BDBM50507688
Synonyms:
CHEMBL4550214 | US11535598, Compound 5
Type:
Small organic molecule
Emp. Form.:
C24H21N3O4
Mol. Mass.:
415.4412
SMILES:
ONC(=O)c1ccc(Cn2c3ccccc3c(=O)n(CCc3ccccc3)c2=O)cc1
: