Target
Androgen receptor
Ligand
BDBM309978
Substrate
Meas. Tech.
Binding Assay
Ki
27.0±n/a nM
Citation
 Wohlfahrt, GTörmäkangas, OSalo, HHöglund, IKarjalainen, AKoivikko, PHolm, PRasku, SVesalainen, A Androgen receptor modulating compounds US Patent  US9657003 Publication Date 5/23/2017 
Target
Name:
Androgen receptor
Synonyms:
ANDR_HUMAN Androgen Receptor Androgen receptor/Baculoviral IAP repeat-containing protein 2 Dihydrotestosterone receptor Nuclear receptor subfamily 3 group C member 4
Type:
Receptor
Mol. Mass.:
99185.27
Organism:
Homo sapiens (Human)
Description:
CHO cells were stably transfected with human AR gene.
Residue:
920
  
Inhibitor
Name:
BDBM309978
Synonyms:
N-(2-(3-(3,4-dicyanophenyl)-1H-pyrazol-1-yl)ethyl)-3-(pyridin-3-yl)-1H-pyrazole-5-carboxamide US9657003, 52
Type:
Small organic molecule
Emp. Form.:
C22H16N8O
Mol. Mass.:
408.4154
SMILES:
O=C(NCCn1ccc(n1)-c1ccc(C#N)c(c1)C#N)c1cc(n[nH]1)-c1cccnc1
: