Target
Androgen receptor
Ligand
BDBM309985
Substrate
Meas. Tech.
Binding Assay
Ki
38.0±n/a nM
Citation
 Wohlfahrt, GTörmäkangas, OSalo, HHöglund, IKarjalainen, AKoivikko, PHolm, PRasku, SVesalainen, A Androgen receptor modulating compounds US Patent  US9657003 Publication Date 5/23/2017 
Target
Name:
Androgen receptor
Synonyms:
ANDR_HUMAN Androgen Receptor Androgen receptor/Baculoviral IAP repeat-containing protein 2 Dihydrotestosterone receptor Nuclear receptor subfamily 3 group C member 4
Type:
Receptor
Mol. Mass.:
99185.27
Organism:
Homo sapiens (Human)
Description:
CHO cells were stably transfected with human AR gene.
Residue:
920
  
Inhibitor
Name:
BDBM309985
Synonyms:
N-((S)-1-(3-(3-chloro-4-cyanophenyl)-1H-pyrazol-1-yl)propan-2-yl)-5-(1-hydroxyethyl)isoxazole-3-carboxamide | US9657003, 124
Type:
Small organic molecule
Emp. Form.:
C19H18ClN5O3
Mol. Mass.:
399.831
SMILES:
C[C@@H](Cn1ccc(n1)-c1ccc(C#N)c(Cl)c1)NC(=O)c1cc(on1)C(C)O
: