Target
Androgen receptor
Ligand
BDBM309994
Substrate
Meas. Tech.
Binding Assay
IC50
228±n/a nM
Citation
 Wohlfahrt, GTörmäkangas, OSalo, HHöglund, IKarjalainen, AKoivikko, PHolm, PRasku, SVesalainen, A Androgen receptor modulating compounds US Patent  US9657003 Publication Date 5/23/2017 
Target
Name:
Androgen receptor
Synonyms:
ANDR_HUMAN Androgen Receptor Androgen receptor/Baculoviral IAP repeat-containing protein 2 Dihydrotestosterone receptor Nuclear receptor subfamily 3 group C member 4
Type:
Receptor
Mol. Mass.:
99185.27
Organism:
Homo sapiens (Human)
Description:
CHO cells were stably transfected with human AR gene.
Residue:
920
  
Inhibitor
Name:
BDBM309994
Synonyms:
US9657003, Bicalutamide
Type:
Small organic molecule
Emp. Form.:
C19H14F4N2O4S
Mol. Mass.:
442.384
SMILES:
CC(O)(CS(=O)(=O)c1ccc(F)cc1)[c](=O):c:n-c1ccc(C#N)c(c1)C(F)(F)F
: