Target
Dipeptidyl peptidase 4
Ligand
BDBM142088
Substrate
Meas. Tech.
EnPlex (purified enzyme activity assay)
IC50
0.200±n/a nM
Citation
 Bachovchin, WWLai, HWu, W Combination therapies using caspase-1 dependent anticancer agents and PGE2 antagonists US Patent  US11559537 Publication Date 1/24/2023 
Target
Name:
Dipeptidyl peptidase 4
Synonyms:
ADABP Adenosine deaminase complexing protein 2 CD_antigen=CD26 DPP4 DPPIV Dipeptidyl peptidase 4 (DPP IV) Dipeptidyl peptidase 4 (DPP4) Dipeptidyl peptidase 4 membrane form Dipeptidyl peptidase IV Dipeptidyl peptidase IV (DDP-IV) Dipeptidyl peptidase IV membrane form Dipeptidyl peptidase-IV (DPP-4) T-cell activation antigen CD26 | TP103
Type:
Enzyme
Mol. Mass.:
88271.01
Organism:
Homo sapiens (Human)
Description:
P27487
Residue:
766
  
Inhibitor
Name:
BDBM142088
Synonyms:
US11096924, DASH-inhibitors 2243 US8933056, Ala-boroPro Thioxamide
Type:
Small organic molecule
Emp. Form.:
C7H15BN2O2S
Mol. Mass.:
202.082
SMILES:
C[C@H](N)C(=S)N1CCC[C@H]1B(O)O
: