Target
Mannan-binding lectin serine protease 2
Ligand
BDBM32761
Substrate
Meas. Tech.
Enzymatic Assay for MASP-2
Ki
<1000±n/a nM
Citation
 Cutshall, NSGage, JLGruswitz, FAKhalaf, JLittle, TLMetz, MNguyen, JHNollert von Specht, PKTsoung, JCicirelli, MGoldstein, SRKeshipeddy, SKKwon, DYLemus, RHVaddela, SB MASP-2 inhibitors and methods of use US Patent  US11584714 Publication Date 2/21/2023 
Target
Name:
Mannan-binding lectin serine protease 2
Synonyms:
3.4.21.104 MASP2 MBL-associated serine protease 2 Mannan-binding lectin serine protease 2 B chain | Mannose-binding protein-associated serine protease 2
Type:
PROTEIN
Mol. Mass.:
75689.43
Organism:
Homo sapiens
Description:
ChEMBL_117891
Residue:
686
  
Inhibitor
Name:
BDBM32761
Synonyms:
2-furancarboxylic acid [5-amino-1-(4-methoxyphenyl)sulfonyl-3-pyrazolyl] ester MLS000033887 US11584714, Compound 40# [5-azanyl-1-(4-methoxyphenyl)sulfonyl-pyrazol-3-yl] furan-2-carboxylate furan-2-carboxylic acid [5-amino-1-(4-methoxyphenyl)sulfonyl-pyrazol-3-yl] ester
Type:
Small organic molecule
Emp. Form.:
C15H13N3O6S
Mol. Mass.:
363.345
SMILES:
COc1ccc(cc1)S(=O)(=O)n1nc(OC(=O)c2ccco2)cc1N
: