Target
Prothrombin
Ligand
BDBM32761
Substrate
Meas. Tech.
Enzymatic Assay for Thrombin
Ki
<1000±n/a nM
Citation
 Cutshall, NSGage, JLGruswitz, FAKhalaf, JLittle, TLMetz, MNguyen, JHNollert von Specht, PKTsoung, JCicirelli, MGoldstein, SRKeshipeddy, SKKwon, DYLemus, RHVaddela, SB MASP-2 inhibitors and methods of use US Patent  US11584714 Publication Date 2/21/2023 
Target
Name:
Prothrombin
Synonyms:
Activation peptide fragment 1 Coagulation factor II Prothrombin precursor Thrombin heavy chain | Thrombin light chain
Type:
Protein
Mol. Mass.:
70029.57
Organism:
Homo sapiens (Human)
Description:
P00734
Residue:
622
  
Inhibitor
Name:
BDBM32761
Synonyms:
2-furancarboxylic acid [5-amino-1-(4-methoxyphenyl)sulfonyl-3-pyrazolyl] ester MLS000033887 US11584714, Compound 40# [5-azanyl-1-(4-methoxyphenyl)sulfonyl-pyrazol-3-yl] furan-2-carboxylate furan-2-carboxylic acid [5-amino-1-(4-methoxyphenyl)sulfonyl-pyrazol-3-yl] ester
Type:
Small organic molecule
Emp. Form.:
C15H13N3O6S
Mol. Mass.:
363.345
SMILES:
COc1ccc(cc1)S(=O)(=O)n1nc(OC(=O)c2ccco2)cc1N
: