Target
Macrophage colony-stimulating factor 1 receptor
Ligand
BDBM595657
Substrate
Meas. Tech.
Kinase Activity Assay
IC50
0.550±n/a nM
Citation
 Liu, SYu, ZPang, WWang, JChen, P Highly active CSF1R inhibitor compound US Patent  US11591328 Publication Date 2/28/2023 
Target
Name:
Macrophage colony-stimulating factor 1 receptor
Synonyms:
CSF1R FMS Macrophage colony stimulating factor receptor Macrophage colony-stimulating factor 1 receptor (c-FMS) Proto-oncogene c-Fms c-fms | cFMS
Type:
Protein
Mol. Mass.:
107979.48
Organism:
Homo sapiens (Human)
Description:
P07333
Residue:
972
  
Inhibitor
Name:
BDBM595657
Synonyms:
US11591328, Compound 10
Type:
Small organic molecule
Emp. Form.:
C21H20N6O3
Mol. Mass.:
404.4219
SMILES:
Cn1cc(cn1)-c1cc(Oc2ccc(NC(=O)N3CCC4(CC4)C3=O)nc2)ccn1
: