Target
Fibroblast growth factor receptor 4
Ligand
BDBM597750
Substrate
Meas. Tech.
Enzymologic Experiment of FGFR4
IC50
0.720±n/a nM
Citation
 Gao, PSun, GTan, SLiu, LBao, R FGFR4 inhibitor and preparation method and use thereof US Patent  US11608332 Publication Date 3/21/2023 
Target
Name:
Fibroblast growth factor receptor 4
Synonyms:
CD_antigen: CD334 FGFR4 FGFR4 Fibroblast growth factor receptor JK2 TKF
Type:
Protein
Mol. Mass.:
87957.45
Organism:
Homo sapiens (Human)
Description:
P22455
Residue:
802
  
Inhibitor
Name:
BDBM597750
Synonyms:
(S)—N-(5-Cyano-4-((2-methoxyethyl)amino)pyridin-2-yl)-7-formyl-6-((N-methyltetrahydrofuran-2-carboxamido)methyl)-3,4-dihydro-1,8-naphthyridin-1(2H)-carb oxamide | US11608332, Example 2
Type:
Small organic molecule
Emp. Form.:
C26H31N7O5
Mol. Mass.:
521.5682
SMILES:
COCCNc1cc(NC(=O)N2CCCc3cc(CN(C)C(=O)[C@@H]4CCCO4)c(C=O)nc23)ncc1C#N
: