Target
Apelin receptor
Ligand
BDBM310573
Substrate
Meas. Tech.
[35S]GTPgammaS Binding
EC50
410±n/a nM
Citation
 Chen, XCheng, ACConnors, RVDebenedetto, MVDransfield, PJFu, ZHarvey, JSHeath, JAHouze, JJudd, TCKopecky, DJLai, SMa, ZNishimura, NOlson, SHPattaropong, VWang, X Compounds for use in preparing heterocyclic triazole agonists of the APJ receptor US Patent  US10150760 Publication Date 12/11/2018 
Target
Name:
Apelin receptor
Synonyms:
AGTRL1 APJ_HUMAN Angiotensin receptor-like 1 Apelin receptor (APJ) G-protein coupled receptor HG11
Type:
Enzyme Catalytic Domain
Mol. Mass.:
42664.06
Organism:
Homo sapiens (Human)
Description:
P35414
Residue:
380
  
Inhibitor
Name:
BDBM310573
Synonyms:
US10150760, Example 401.0 | US10150760, Example 402.0
Type:
Small organic molecule
Emp. Form.:
C18H22ClN7O5S
Mol. Mass.:
483.929
SMILES:
CO[C@@H]([C@H](C)S(=O)(=O)Nc1nnc([C@H]2CCOC2)n1Cc1ccon1)c1ncc(Cl)cn1
: