Target
Serine/threonine-protein kinase pim-1
Ligand
BDBM601978
Substrate
Meas. Tech.
Pim-1 Inhibitory Activity Assay
Ki
0.039±n/a nM
Citation
 Inoue, MOgoshi, YFurukawa, TMachida, TMitani, IHarada, KNakagawa, YYamaoka, N Tetrahydrobenzofurodiazepinone compound and pharmaceutical use thereof US Patent  US11643417 Publication Date 5/9/2023 
Target
Name:
Serine/threonine-protein kinase pim-1
Synonyms:
PIM-1 Kinase PIM1_HUMAN Serine/threonine-protein kinase (PIM1) Serine/threonine-protein kinase PIM1 | Serine/threonine-protein kinase pim-1 (PIM1)
Type:
Protein
Mol. Mass.:
35681.82
Organism:
Homo sapiens (Human)
Description:
P11309
Residue:
313
  
Inhibitor
Name:
BDBM601978
Synonyms:
US11643417, Ex. No. 11 US11643417, Ex. No. 58 US11643417, Ex. No. 66 | US11643417, Ex. No. 67
Type:
Small organic molecule
Emp. Form.:
C20H21F5N2O4
Mol. Mass.:
448.3838
SMILES:
CC1(O)CCOC(C1)C(F)(F)CN1CCNC(=O)c2oc3ccc(cc3c12)C(F)(F)F
: