Target
Serine/threonine-protein kinase pim-1
Ligand
BDBM602029
Substrate
Meas. Tech.
Pim-1 Inhibitory Activity Assay
Ki
0.071±n/a nM
Citation
 Inoue, MOgoshi, YFurukawa, TMachida, TMitani, IHarada, KNakagawa, YYamaoka, N Tetrahydrobenzofurodiazepinone compound and pharmaceutical use thereof US Patent  US11643417 Publication Date 5/9/2023 
Target
Name:
Serine/threonine-protein kinase pim-1
Synonyms:
PIM-1 Kinase PIM1_HUMAN Serine/threonine-protein kinase (PIM1) Serine/threonine-protein kinase PIM1 | Serine/threonine-protein kinase pim-1 (PIM1)
Type:
Protein
Mol. Mass.:
35681.82
Organism:
Homo sapiens (Human)
Description:
P11309
Residue:
313
  
Inhibitor
Name:
BDBM602029
Synonyms:
US11643417, Ex. No. 46
Type:
Small organic molecule
Emp. Form.:
C21H21F5N2O5
Mol. Mass.:
476.3939
SMILES:
FC(F)(F)c1ccc2oc3c(N(CC(F)(F)C4CC5(CCO4)OCCO5)CCNC3=O)c2c1
: