Target
Serine/threonine-protein kinase pim-1
Ligand
BDBM602075
Substrate
Meas. Tech.
Pim-1 Inhibitory Activity Assay
Ki
0.009±n/a nM
Citation
 Inoue, MOgoshi, YFurukawa, TMachida, TMitani, IHarada, KNakagawa, YYamaoka, N Tetrahydrobenzofurodiazepinone compound and pharmaceutical use thereof US Patent  US11643417 Publication Date 5/9/2023 
Target
Name:
Serine/threonine-protein kinase pim-1
Synonyms:
PIM-1 Kinase PIM1_HUMAN Serine/threonine-protein kinase (PIM1) Serine/threonine-protein kinase PIM1 | Serine/threonine-protein kinase pim-1 (PIM1)
Type:
Protein
Mol. Mass.:
35681.82
Organism:
Homo sapiens (Human)
Description:
P11309
Residue:
313
  
Inhibitor
Name:
BDBM602075
Synonyms:
US11643417, Ex. No. 90
Type:
Small organic molecule
Emp. Form.:
C21H25F3N2O4
Mol. Mass.:
426.4294
SMILES:
OC[C@@]1(O)CC[C@H](CCN2CCNC(=O)c3oc4ccc(cc4c23)C(F)(F)F)CC1
: