Target
Serine/threonine-protein kinase pim-1
Ligand
BDBM602103
Substrate
Meas. Tech.
Pim-1 Inhibitory Activity Assay
Ki
0.009±n/a nM
Citation
 Inoue, MOgoshi, YFurukawa, TMachida, TMitani, IHarada, KNakagawa, YYamaoka, N Tetrahydrobenzofurodiazepinone compound and pharmaceutical use thereof US Patent  US11643417 Publication Date 5/9/2023 
Target
Name:
Serine/threonine-protein kinase pim-1
Synonyms:
PIM-1 Kinase PIM1_HUMAN Serine/threonine-protein kinase (PIM1) Serine/threonine-protein kinase PIM1 | Serine/threonine-protein kinase pim-1 (PIM1)
Type:
Protein
Mol. Mass.:
35681.82
Organism:
Homo sapiens (Human)
Description:
P11309
Residue:
313
  
Inhibitor
Name:
BDBM602103
Synonyms:
US11643417, Ex. No. 116
Type:
Small organic molecule
Emp. Form.:
C23H27F3N2O4
Mol. Mass.:
452.4667
SMILES:
OCC1(O)CCC(CCN2CC3(CC3)NC(=O)c3oc4ccc(cc4c23)C(F)(F)F)CC1
: