Target
Serine/threonine-protein kinase pim-1
Ligand
BDBM602114
Substrate
Meas. Tech.
Pim-1 Inhibitory Activity Assay
Ki
0.053±n/a nM
Citation
 Inoue, MOgoshi, YFurukawa, TMachida, TMitani, IHarada, KNakagawa, YYamaoka, N Tetrahydrobenzofurodiazepinone compound and pharmaceutical use thereof US Patent  US11643417 Publication Date 5/9/2023 
Target
Name:
Serine/threonine-protein kinase pim-1
Synonyms:
PIM-1 Kinase PIM1_HUMAN Serine/threonine-protein kinase (PIM1) Serine/threonine-protein kinase PIM1 | Serine/threonine-protein kinase pim-1 (PIM1)
Type:
Protein
Mol. Mass.:
35681.82
Organism:
Homo sapiens (Human)
Description:
P11309
Residue:
313
  
Inhibitor
Name:
BDBM602114
Synonyms:
US11643417, Ex. No. 127 | US11643417, Ex. No. 128
Type:
Small organic molecule
Emp. Form.:
C23H27F3N2O3
Mol. Mass.:
436.4673
SMILES:
CC1(O)CCC(CCN2CC3(CC3)NC(=O)c3oc4ccc(cc4c23)C(F)(F)F)CC1
: