Target
Serine/threonine-protein kinase pim-1
Ligand
BDBM602165
Substrate
Meas. Tech.
Pim-1 Inhibitory Activity Assay
Ki
0.098±n/a nM
Citation
 Inoue, MOgoshi, YFurukawa, TMachida, TMitani, IHarada, KNakagawa, YYamaoka, N Tetrahydrobenzofurodiazepinone compound and pharmaceutical use thereof US Patent  US11643417 Publication Date 5/9/2023 
Target
Name:
Serine/threonine-protein kinase pim-1
Synonyms:
PIM-1 Kinase PIM1_HUMAN Serine/threonine-protein kinase (PIM1) Serine/threonine-protein kinase PIM1 | Serine/threonine-protein kinase pim-1 (PIM1)
Type:
Protein
Mol. Mass.:
35681.82
Organism:
Homo sapiens (Human)
Description:
P11309
Residue:
313
  
Inhibitor
Name:
BDBM602165
Synonyms:
US11643417, Ex. No. 160
Type:
Small organic molecule
Emp. Form.:
C21H21F5N2O4S
Mol. Mass.:
492.459
SMILES:
FC(F)(F)c1ccc2oc3c(N(CC(F)(F)C4CCS(=O)(=O)CC4)CC4(CC4)NC3=O)c2c1
: