Target
Serine/threonine-protein kinase pim-1
Ligand
BDBM602168
Substrate
Meas. Tech.
Pim-1 Inhibitory Activity Assay
Ki
0.044±n/a nM
Citation
 Inoue, MOgoshi, YFurukawa, TMachida, TMitani, IHarada, KNakagawa, YYamaoka, N Tetrahydrobenzofurodiazepinone compound and pharmaceutical use thereof US Patent  US11643417 Publication Date 5/9/2023 
Target
Name:
Serine/threonine-protein kinase pim-1
Synonyms:
PIM-1 Kinase PIM1_HUMAN Serine/threonine-protein kinase (PIM1) Serine/threonine-protein kinase PIM1 | Serine/threonine-protein kinase pim-1 (PIM1)
Type:
Protein
Mol. Mass.:
35681.82
Organism:
Homo sapiens (Human)
Description:
P11309
Residue:
313
  
Inhibitor
Name:
BDBM602168
Synonyms:
US11643417, Ex. No. 163
Type:
Small organic molecule
Emp. Form.:
C22H24F3N3O3
Mol. Mass.:
435.4395
SMILES:
OCC1(CCC(CCN2CCNC(=O)c3oc4ccc(cc4c23)C(F)(F)F)CC1)C#N
: