Target
Serine/threonine-protein kinase pim-1
Ligand
BDBM602178
Substrate
Meas. Tech.
Pim-1 Inhibitory Activity Assay
Ki
0.074±n/a nM
Citation
 Inoue, MOgoshi, YFurukawa, TMachida, TMitani, IHarada, KNakagawa, YYamaoka, N Tetrahydrobenzofurodiazepinone compound and pharmaceutical use thereof US Patent  US11643417 Publication Date 5/9/2023 
Target
Name:
Serine/threonine-protein kinase pim-1
Synonyms:
PIM-1 Kinase PIM1_HUMAN Serine/threonine-protein kinase (PIM1) Serine/threonine-protein kinase PIM1 | Serine/threonine-protein kinase pim-1 (PIM1)
Type:
Protein
Mol. Mass.:
35681.82
Organism:
Homo sapiens (Human)
Description:
P11309
Residue:
313
  
Inhibitor
Name:
BDBM602178
Synonyms:
US11643417, Ex. No. 2-06
Type:
Small organic molecule
Emp. Form.:
C22H27F3N2O4
Mol. Mass.:
440.456
SMILES:
C[C@H]1CN(CC[C@H]2CC[C@](O)(CO)CC2)c2c(oc3ccc(cc23)C(F)(F)F)C(=O)N1
: