Target
Histone-lysine N-methyltransferase EZH2
Ligand
BDBM310772
Substrate
Meas. Tech.
Wild-Type PRC2 Enzyme Assay
IC50
20.0±n/a nM
Citation
 Campbell, JE Substituted benzene compounds US Patent  US10150764 Publication Date 12/11/2018 
Target
Name:
Histone-lysine N-methyltransferase EZH2
Synonyms:
ENX-1 EZH2_HUMAN Histone-lysine N-methyltransferase EZH2 Lysine N-methyltransferase 6
Type:
Protein
Mol. Mass.:
85367.84
Organism:
Homo sapiens (Human)
Description:
Q15910
Residue:
746
  
Inhibitor
Name:
BDBM310772
Synonyms:
US10150764, Compound 57
Type:
Small organic molecule
Emp. Form.:
C31H42ClN5O3
Mol. Mass.:
568.15
SMILES:
CCN([C@H]1CC[C@@H](CC1)N(C)Cc1cccc(OC)c1)c1cc(Cl)cc(C(=O)NCc2c(C)n(C)[nH]c2=O)c1C
: