Target
Retinol-binding protein 4
Ligand
BDBM249563
Substrate
Meas. Tech.
TR-FRET Assay for Retinol-Induced RBP4-TTR Interaction
IC50
25.8±n/a nM
Citation
 Petrukhin, KCioffi, CJohnson, GAllikmets, RFreeman, EChen, PConlon, MZhu, L Substituted 4-phenylpiperidines, their preparation and use US Patent  US11649240 Publication Date 5/16/2023 
Target
Name:
Retinol-binding protein 4
Synonyms:
PRBP RBP RET4_HUMAN Retinol-binding protein 4 (RBP4) | spa binding assay for rbp4
Type:
Protein
Mol. Mass.:
23008.75
Organism:
Homo sapiens (Human)
Description:
P02753
Residue:
201
  
Inhibitor
Name:
BDBM249563
Synonyms:
US10072016, Compound 161 US10913746, Compound 161 US9434727, 161 | US9777010, Compound 161
Type:
Small organic molecule
Emp. Form.:
C20H15ClF3N5O
Mol. Mass.:
433.814
SMILES:
FC(F)(F)c1ccc(Cl)cc1C1CCN(CC1)C(=O)c1nnc2ccc(cn12)C#N
: