Target
Activin receptor type-1
Ligand
BDBM603850
Substrate
Meas. Tech.
Luciferase Reporter Gene Assay for ALK2 and TGFbeta Activity
IC50
3.00±n/a nM
Citation
 Yu, PBHuang, WSanderson, PEJiang, JShamim, KZheng, WHuang, XTawa, GLee, AAlimardanov, AHuang, J ALK2 inhibitors and methods for inhibiting BMP signaling US Patent  US11654147 Publication Date 5/23/2023 
Target
Name:
Activin receptor type-1
Synonyms:
2.7.11.30 ACVR1 ACVRLK2 ALK2/ACVR1 Activin receptor-like kinase 2 Activin receptor-like kinase 2 (ALK2/ACVR1) SKR1 TGF-B superfamily receptor type I | TSR-I
Type:
Mol. Mass.:
57158.32
Organism:
Homo sapiens (Human)
Description:
Residue:
509
  
Inhibitor
Name:
BDBM603850
Synonyms:
US11654147, Compound 298
Type:
Small organic molecule
Emp. Form.:
C22H22N6
Mol. Mass.:
370.4503
SMILES:
CN1CC2(C1)CN(C2)c1cnc2c(cnn2c1)-c1cc(C)nc2ccccc12
: