Target
Discoidin domain-containing receptor 2
Ligand
BDBM603885
Substrate
Meas. Tech.
Enzyme-linked immunosorbent assay (ELISA)
IC50
0.400±n/a nM
Citation
 Xiong, BLi, JGeng, MShen, JZang, YAi, JChen, DWang, QDong, YPeng, XJi, YTan, Q Fused ring pyrimidine amino compound and preparation method, pharmaceutical composition, and use thereof US Patent  US11655239 Publication Date 5/23/2023 
Target
Name:
Discoidin domain-containing receptor 2
Synonyms:
DDR2 Discoidin domain receptor 2 (DDR2) Discoidin domain-containing receptor 2 (DDR2) NTRKR3 TYRO10
Type:
Protein
Mol. Mass.:
96717.07
Organism:
Homo sapiens (Human)
Description:
Q16832
Residue:
855
  
Inhibitor
Name:
BDBM603885
Synonyms:
US11655239, Compound S1
Type:
Small organic molecule
Emp. Form.:
C27H22F3N7O
Mol. Mass.:
517.5051
SMILES:
Cc1ccc(NC(=O)Nc2cccc(c2)C(F)(F)F)cc1-c1ccc2nc(Nc3cnn(C)c3)ncc2c1
: