Target
Discoidin domain-containing receptor 2
Ligand
BDBM603887
Substrate
Meas. Tech.
Enzyme-linked immunosorbent assay (ELISA)
IC50
0.100±n/a nM
Citation
 Xiong, BLi, JGeng, MShen, JZang, YAi, JChen, DWang, QDong, YPeng, XJi, YTan, Q Fused ring pyrimidine amino compound and preparation method, pharmaceutical composition, and use thereof US Patent  US11655239 Publication Date 5/23/2023 
Target
Name:
Discoidin domain-containing receptor 2
Synonyms:
DDR2 Discoidin domain receptor 2 (DDR2) Discoidin domain-containing receptor 2 (DDR2) NTRKR3 TYRO10
Type:
Protein
Mol. Mass.:
96717.07
Organism:
Homo sapiens (Human)
Description:
Q16832
Residue:
855
  
Inhibitor
Name:
BDBM603887
Synonyms:
US11655239, Compound S4
Type:
Small organic molecule
Emp. Form.:
C29H25F3N6O
Mol. Mass.:
530.5436
SMILES:
CC(NC(=O)c1cccc(c1)C(F)(F)F)c1ccc(C)c(c1)-c1ccc2cnc(Nc3cnn(C)c3)nc2c1
: