Target
Discoidin domain-containing receptor 2
Ligand
BDBM603900
Substrate
Meas. Tech.
Enzyme-linked immunosorbent assay (ELISA)
IC50
0.700±n/a nM
Citation
 Xiong, BLi, JGeng, MShen, JZang, YAi, JChen, DWang, QDong, YPeng, XJi, YTan, Q Fused ring pyrimidine amino compound and preparation method, pharmaceutical composition, and use thereof US Patent  US11655239 Publication Date 5/23/2023 
Target
Name:
Discoidin domain-containing receptor 2
Synonyms:
DDR2 Discoidin domain receptor 2 (DDR2) Discoidin domain-containing receptor 2 (DDR2) NTRKR3 TYRO10
Type:
Protein
Mol. Mass.:
96717.07
Organism:
Homo sapiens (Human)
Description:
Q16832
Residue:
855
  
Inhibitor
Name:
BDBM603900
Synonyms:
US11655239, Compound S14
Type:
Small organic molecule
Emp. Form.:
C29H23F3N6O
Mol. Mass.:
528.5277
SMILES:
Cn1cc(Nc2ncc3cc(ccc3n2)-c2cc(ccc2C2CC2)C(=O)Nc2cccc(c2)C(F)(F)F)cn1
: