Target
Discoidin domain-containing receptor 2
Ligand
BDBM603907
Substrate
Meas. Tech.
Enzyme-linked immunosorbent assay (ELISA)
IC50
1.10±n/a nM
Citation
 Xiong, BLi, JGeng, MShen, JZang, YAi, JChen, DWang, QDong, YPeng, XJi, YTan, Q Fused ring pyrimidine amino compound and preparation method, pharmaceutical composition, and use thereof US Patent  US11655239 Publication Date 5/23/2023 
Target
Name:
Discoidin domain-containing receptor 2
Synonyms:
DDR2 Discoidin domain receptor 2 (DDR2) Discoidin domain-containing receptor 2 (DDR2) NTRKR3 TYRO10
Type:
Protein
Mol. Mass.:
96717.07
Organism:
Homo sapiens (Human)
Description:
Q16832
Residue:
855
  
Inhibitor
Name:
BDBM603907
Synonyms:
US11655239, Compound S27
Type:
Small organic molecule
Emp. Form.:
C29H26F3N7O
Mol. Mass.:
545.5582
SMILES:
CC(NC(=O)Nc1cccc(c1)C(F)(F)F)c1ccc(C)c(c1)-c1ccc2nc(Nc3cnn(C)c3)ncc2c1
: