Target
Multidrug and toxin extrusion protein 2
Ligand
BDBM273241
Substrate
Meas. Tech.
MATE2-K IC50 Assay
IC50
300±n/a nM
Citation
 Ammann, SECanales, EYChang, WKKinfe, HHLazerwith, SEMitchell, MLMoazami, YSchroeder, SDShore, DGSwank, CJ Thienopyrrole compounds US Patent  US11661431 Publication Date 5/30/2023 
Target
Name:
Multidrug and toxin extrusion protein 2
Synonyms:
Kidney-specific H(+)/organic cation antiporter MATE2 SLC47A2 hMATE-2
Type:
PROTEIN
Mol. Mass.:
65098.38
Organism:
Homo sapiens (Human)
Description:
ChEMBL_934314
Residue:
602
  
Inhibitor
Name:
BDBM273241
Synonyms:
2-(4-(2-(7,8-dimethyl-[1,2,4]triazolo[1,5-a]pyridin-6-yl)-3-isopropyl-1H-indol-5-yl) piperidin-1-yl)acetamide US10478424, Example 15 | US11661431, Example A-1
Type:
Small organic molecule
Emp. Form.:
C26H32N6O
Mol. Mass.:
444.5719
SMILES:
CC(C)c1c([nH]c2ccc(cc12)C1CCN(CC(N)=O)CC1)-c1cn2ncnc2c(C)c1C
: