Target
Glycogen synthase kinase-3 beta
Ligand
BDBM385240
Substrate
Meas. Tech.
GSK3B Kinase Assay
EC50
46.0±n/a nM
Citation
 KC, SKMittapalli, GKHofilena, BJMarakovits, JTChiruta, CMak, CCCao, J Isoquinolin-3-yl carboxamides and preparation and use thereof US Patent  US11673881 Publication Date 6/13/2023 
Target
Name:
Glycogen synthase kinase-3 beta
Synonyms:
GSK-3 beta GSK3B Glycogen synthase kinase 3 beta (GSK3B) Glycogen synthase kinase-3 beta (GSK-3B) Glycogen synthase kinase-3 beta (GSK3B) Glycogen synthase kinase-3beta (GSK3B) | Serine/threonine-protein kinase GSK3B
Type:
Enzyme
Mol. Mass.:
46756.38
Organism:
Homo sapiens (Human)
Description:
P49841
Residue:
420
  
Inhibitor
Name:
BDBM385240
Synonyms:
US10287267, Compound 707 US10556885, Compound 707 US11673881, Compound 707
Type:
Small organic molecule
Emp. Form.:
C21H24N4OS
Mol. Mass.:
380.506
SMILES:
CN(C)[C@H]1CC[C@@H](CC1)C(=O)Nc1cc2cc(ccc2cn1)-c1cncs1
: