Target
Glycogen synthase kinase-3 beta
Ligand
BDBM385277
Substrate
Meas. Tech.
GSK3B Kinase Assay
EC50
102±n/a nM
Citation
 KC, SKMittapalli, GKHofilena, BJMarakovits, JTChiruta, CMak, CCCao, J Isoquinolin-3-yl carboxamides and preparation and use thereof US Patent  US11673881 Publication Date 6/13/2023 
Target
Name:
Glycogen synthase kinase-3 beta
Synonyms:
GSK-3 beta GSK3B Glycogen synthase kinase 3 beta (GSK3B) Glycogen synthase kinase-3 beta (GSK-3B) Glycogen synthase kinase-3 beta (GSK3B) Glycogen synthase kinase-3beta (GSK3B) | Serine/threonine-protein kinase GSK3B
Type:
Enzyme
Mol. Mass.:
46756.38
Organism:
Homo sapiens (Human)
Description:
P49841
Residue:
420
  
Inhibitor
Name:
BDBM385277
Synonyms:
US10287267, Compound 964 US10556885, Compound 964 US11673881, Compound 964
Type:
Small organic molecule
Emp. Form.:
C25H25N5O3S
Mol. Mass.:
475.563
SMILES:
Cn1cc(cn1)-c1ccc2cnc(NC(=O)C3CCN(CC3)S(=O)(=O)c3ccccc3)cc2c1
: