Target
Receptor tyrosine-protein kinase erbB-2
Ligand
BDBM376961
Substrate
Meas. Tech.
Inhibitory Effect on HER2-Phosphorylating Activity (In Vitro)
IC50
20.0±n/a nM
Citation
 Irie, HOguchi, KFujioka, Y Agent enhancing antitumor effect using pyrazolo[3,4-d]pyrimidine compound US Patent  US11696917 Publication Date 7/11/2023 
Target
Name:
Receptor tyrosine-protein kinase erbB-2
Synonyms:
2.7.10.1 CD_antigen=CD340 ERBB2_HUMAN FASN/HER2 HER2 MLN19 NEU Proto-oncogene Neu Tyrosine kinase-type cell surface receptor HER2 | p185erbB2
Type:
Mol. Mass.:
137894.47
Organism:
Homo sapiens (Human)
Description:
P04626
Residue:
1255
  
Inhibitor
Name:
BDBM376961
Synonyms:
US10329300, Example 49 US9920060, 49
Type:
Small organic molecule
Emp. Form.:
C26H32N8O3
Mol. Mass.:
504.5841
SMILES:
CCc1cc(CC(=O)N(C)C)ccc1NC(=O)c1nn([C@@H]2CCCN(C2)C(=O)C=C)c2ncnc(N)c12
: