Target
Trace amine-associated receptor 1
Ligand
BDBM250401
Substrate
Meas. Tech.
Radioligand Binding Assay on Mouse TAAR1
Ki
0.500±n/a nM
Citation
 Groebke Zbinden, KNorcross, RPfileger, P Substituted benzamides US Patent  US11697636 Publication Date 7/11/2023 
Target
Name:
Trace amine-associated receptor 1
Synonyms:
TAAR1_MOUSE Taar1 Trace amine receptor 1 (TARR1) Trace amine-associated receptor1 | Trar1
Type:
Protein
Mol. Mass.:
37635.41
Organism:
Mus musculus (Mouse)
Description:
Q923Y8
Residue:
332
  
Inhibitor
Name:
BDBM250401
Synonyms:
US10501411, Example 311 US9452980, 311
Type:
Small organic molecule
Emp. Form.:
C18H18F3N3O2
Mol. Mass.:
365.3496
SMILES:
FC(F)(F)c1ccc(NC(=O)Nc2ccc(cc2)[C@@H]2CNCCO2)cc1
: