Target
Bromodomain-containing protein 4 [44-167]
Ligand
BDBM391506
Substrate
Meas. Tech.
AlphaScreen Assay
IC50
<100±n/a nM
Citation
 Combs, APMaduskuie, Jr., TPFalahatpisheh, N 1H-pyrrolo[2,3-c]pyridin-7(6H)-ones and pyrazolo[3,4-c]pyridin-7(6H)-ones as inhibitors of BET proteins US Patent  US11702416 Publication Date 7/18/2023 
Target
Name:
Bromodomain-containing protein 4 [44-167]
Synonyms:
BRD4 BRD4_HUMAN HUNK1
Type:
Enzyme Catalytic Domain
Mol. Mass.:
14738.39
Organism:
Homo sapiens (Human)
Description:
O60885[44-167]
Residue:
124
  
Inhibitor
Name:
BDBM391506
Synonyms:
US10472358, Example 6 US11059821, Example 6 US9957268, Example 6
Type:
Small organic molecule
Emp. Form.:
C19H17N3O3
Mol. Mass.:
335.3566
SMILES:
Cn1cc(-c2cccc3NC(=O)C(Oc23)C2CC2)c2cc[nH]c2c1=O
: