Target
Heat shock factor protein 1
Ligand
BDBM610135
Substrate
Meas. Tech.
Cell-Based ELISA (Cellisa) Assay
IC50
2.00±n/a nM
Citation
 Jones, KRye, CChessum, NCheeseman, MPasqua, AEPike, KGFaulder, PF Fused 1,4-dihydrodioxin derivatives as inhibitors of heat shock transcription factor 1 US Patent  US9701664 Publication Date 7/11/2017 
Target
Name:
Heat shock factor protein 1
Synonyms:
HSF1 HSTF1
Type:
PROTEIN
Mol. Mass.:
57244.20
Organism:
Homo sapiens (Human)
Description:
ChEMBL_1512556
Residue:
529
  
Inhibitor
Name:
BDBM610135
Synonyms:
(R)-N-(5-(2,3-dihydrobenzo[b][1,4]dioxine-6-carboxamido)-2-methylphenyl)-2-((1-methylpyrrolidin-3-yl)oxy)quinoline-6-carboxamide | US9701664, Example 49
Type:
Small organic molecule
Emp. Form.:
C31H30N4O5
Mol. Mass.:
538.5937
SMILES:
CN1CC[C@H](C1)Oc1ccc2cc(ccc2n1)C(=O)Nc1cc(NC(=O)c2ccc3OCCOc3c2)ccc1C
: