Target
Heat shock factor protein 1
Ligand
BDBM610144
Substrate
Meas. Tech.
Cell-Based ELISA (Cellisa) Assay
IC50
13.0±n/a nM
Citation
 Jones, KRye, CChessum, NCheeseman, MPasqua, AEPike, KGFaulder, PF Fused 1,4-dihydrodioxin derivatives as inhibitors of heat shock transcription factor 1 US Patent  US9701664 Publication Date 7/11/2017 
Target
Name:
Heat shock factor protein 1
Synonyms:
HSF1 HSTF1
Type:
PROTEIN
Mol. Mass.:
57244.20
Organism:
Homo sapiens (Human)
Description:
ChEMBL_1512556
Residue:
529
  
Inhibitor
Name:
BDBM610144
Synonyms:
N-(5-(2,3-dihydrobenzo[b][1,4]dioxine-6-carboxamido)-2-methylphenyl)-2-(3-morpholinopropoxy)quinoline-6-carboxamide | US9701664, Example 55
Type:
Small organic molecule
Emp. Form.:
C33H34N4O6
Mol. Mass.:
582.6463
SMILES:
Cc1ccc(NC(=O)c2ccc3OCCOc3c2)cc1NC(=O)c1ccc2nc(OCCCN3CCOCC3)ccc2c1
: