Target
Heat shock factor protein 1
Ligand
BDBM50234085
Substrate
Meas. Tech.
Cell-Based ELISA (Cellisa) Assay
IC50
13.0±n/a nM
Citation
 Jones, KRye, CChessum, NCheeseman, MPasqua, AEPike, KGFaulder, PF Fused 1,4-dihydrodioxin derivatives as inhibitors of heat shock transcription factor 1 US Patent  US9701664 Publication Date 7/11/2017 
Target
Name:
Heat shock factor protein 1
Synonyms:
HSF1 HSTF1
Type:
PROTEIN
Mol. Mass.:
57244.20
Organism:
Homo sapiens (Human)
Description:
ChEMBL_1512556
Residue:
529
  
Inhibitor
Name:
BDBM50234085
Synonyms:
CHEMBL4102297 | US9701664, Example 89
Type:
Small organic molecule
Emp. Form.:
C28H26N4O5
Mol. Mass.:
498.5298
SMILES:
Cc1ccc(NC(=O)c2ccc3OCCOc3c2)cc1NC(=O)c1ccc2nc(OCCN)ccc2c1
: