Target
Glycogen synthase kinase-3 beta
Ligand
BDBM610461
Substrate
Meas. Tech.
Kinase assay
IC50
0.400±n/a nM
Citation
 Hartz, RAAhuja, VTSivaprakasam, PDubowchik, GMMacor, JE GSK-3 inhibitors US Patent  US10774086 Publication Date 9/15/2020 
Target
Name:
Glycogen synthase kinase-3 beta
Synonyms:
GSK-3 beta GSK3B Glycogen synthase kinase 3 beta (GSK3B) Glycogen synthase kinase-3 beta (GSK-3B) Glycogen synthase kinase-3 beta (GSK3B) Glycogen synthase kinase-3beta (GSK3B) | Serine/threonine-protein kinase GSK3B
Type:
Enzyme
Mol. Mass.:
46756.38
Organism:
Homo sapiens (Human)
Description:
P49841
Residue:
420
  
Inhibitor
Name:
BDBM610461
Synonyms:
N-(4-(4,4-Difluoropiperidin-1-yl)pyridin-3-yl)-2-phenylimidazo[1,2-b]pyridazine-8-carboxamide | US10774086, Example 12
Type:
Small organic molecule
Emp. Form.:
C23H20F2N6O
Mol. Mass.:
434.4413
SMILES:
FC1(F)CCN(CC1)c1ccncc1NC(=O)c1ccnn2cc(nc12)-c1ccccc1
: