Target
Tyrosine-protein kinase JAK1
Ligand
BDBM292118
Substrate
Meas. Tech.
Biochemical Assay
Ki
<0.1±n/a nM
Citation
 Fatheree, PRJacobsen, JRBeausoleil, ABrandt, GEFleury, MJiang, LSmith, CSullivan, SDVan Orden, LJColson, PFass, GTRapta, MBenjamin, NDabros, MThalladi, VR JAK kinase inhibitor compounds for treatment of respiratory disease US Patent  US11718616 Publication Date 8/8/2023 
Target
Name:
Tyrosine-protein kinase JAK1
Synonyms:
JAK-1 JAK1A JAK1_HUMAN Janus kinase 1 (JAK1) | Janus kinase 1 JAK1
Type:
Protein
Mol. Mass.:
133293.73
Organism:
Homo sapiens (Human)
Description:
P23458
Residue:
1154
  
Inhibitor
Name:
BDBM292118
Synonyms:
US10100049, Example 15 US10526330, Example 15 US11299492, Example 15 | US11718616, Example 15
Type:
Small organic molecule
Emp. Form.:
C28H33FN6O
Mol. Mass.:
488.5996
SMILES:
CCc1cc(O)c(F)cc1-c1ccc2c(n[nH]c2c1)-c1nc2CN(CCN3CCC[C@@H]3C)CCc2[nH]1
: