Target
Cannabinoid receptor 2
Ligand
BDBM295673
Substrate
Meas. Tech.
In Vitro Testing of CB2 Potency: CB2 cAMP (Assay 1)
EC50
104±n/a nM
Citation
 Riether, DBinder, FPDoods, HMueller, SGNicholson, JRSauer, A (Cyano-dimethyl-methyl)-isoxazoles and -[1,3,4]thiadiazoles US Patent  US11725004 Publication Date 8/15/2023 
Target
Name:
Cannabinoid receptor 2
Synonyms:
CANNABINOID CB2 CB2 CB2B CNR2_HUMAN Cannabinoid CB2 receptor Cannabinoid receptor 2 (CB2R) | hCB2
Type:
G Protein-Coupled Receptor (GPCR)
Mol. Mass.:
39690.94
Organism:
Homo sapiens (Human)
Description:
P34972
Residue:
360
  
Inhibitor
Name:
BDBM295673
Synonyms:
US10112934, Example 2 US11084810, Example 2 | US11725004, Example 2
Type:
Small organic molecule
Emp. Form.:
C17H25N3O5S
Mol. Mass.:
383.463
SMILES:
CC(C)(C#N)c1cc(NC(=O)C(C)(C)S(=O)(=O)CC2CCOCC2)on1
: