Target
Cannabinoid receptor 1
Ligand
BDBM295673
Substrate
Meas. Tech.
In Vitro Testing of CB1 Potency: CB1 cAMP (Assay 2)
IC50
>200000±n/a nM
Citation
 Riether, DBinder, FPDoods, HMueller, SGNicholson, JRSauer, A (Cyano-dimethyl-methyl)-isoxazoles and -[1,3,4]thiadiazoles US Patent  US11725004 Publication Date 8/15/2023 
Target
Name:
Cannabinoid receptor 1
Synonyms:
CANN6 CB-R CNR CNR1_HUMAN Cannabinoid receptor Cannabinoid receptor 1 (brain)
Type:
G Protein-Coupled Receptor (GPCR)
Mol. Mass.:
52868.96
Organism:
Homo sapiens (Human)
Description:
P21554
Residue:
472
  
Inhibitor
Name:
BDBM295673
Synonyms:
US10112934, Example 2 US11084810, Example 2 | US11725004, Example 2
Type:
Small organic molecule
Emp. Form.:
C17H25N3O5S
Mol. Mass.:
383.463
SMILES:
CC(C)(C#N)c1cc(NC(=O)C(C)(C)S(=O)(=O)CC2CCOCC2)on1
: