Target
Interleukin-17F
Ligand
BDBM617546
Substrate
Meas. Tech.
AlphaLISA Assay
IC50
100±n/a nM
Citation
 MARTIN, BPWESTERMANN, JKERN, OTHOLMES, AJMORRISON, AKICZUN, MAL MASRI, MSMITH, AHUXLEY, A IL-17A MODULATORS US Patent  US20230286943 Publication Date 9/14/2023 
Target
Name:
Interleukin-17F
Synonyms:
Cytokine ML-1 IL17F_HUMAN | il-17f
Type:
Enzyme Catalytic Domain
Mol. Mass.:
18053.35
Organism:
Homo sapiens (Human)
Description:
Q96PD4
Residue:
163
  
Inhibitor
Name:
BDBM617546
Synonyms:
US20230286943, Example 14
Type:
Small organic molecule
Emp. Form.:
C25H32N4O3
Mol. Mass.:
436.5466
SMILES:
C[C@H]1CC[C@@H](CC1)[C@H](NC(=O)c1ccnn1C)C(=O)Nc1ccc(cc1)C1=CCOCC1
: