Target
Interleukin-17F
Ligand
BDBM617567
Substrate
Meas. Tech.
AlphaLISA Assay
IC50
63.1±n/a nM
Citation
 MARTIN, BPWESTERMANN, JKERN, OTHOLMES, AJMORRISON, AKICZUN, MAL MASRI, MSMITH, AHUXLEY, A IL-17A MODULATORS US Patent  US20230286943 Publication Date 9/14/2023 
Target
Name:
Interleukin-17F
Synonyms:
Cytokine ML-1 IL17F_HUMAN | il-17f
Type:
Enzyme Catalytic Domain
Mol. Mass.:
18053.35
Organism:
Homo sapiens (Human)
Description:
Q96PD4
Residue:
163
  
Inhibitor
Name:
BDBM617567
Synonyms:
US20230286943, Example 35
Type:
Small organic molecule
Emp. Form.:
C24H29N5O4
Mol. Mass.:
451.5182
SMILES:
Cc1nocc1C(=O)N[C@@H](C1CCCCCC1)C(=O)Nc1ccc(cn1)-c1c(C)noc1C
: