Target
Interleukin-17F
Ligand
BDBM617577
Substrate
Meas. Tech.
AlphaLISA Assay
IC50
50.1±n/a nM
Citation
 MARTIN, BPWESTERMANN, JKERN, OTHOLMES, AJMORRISON, AKICZUN, MAL MASRI, MSMITH, AHUXLEY, A IL-17A MODULATORS US Patent  US20230286943 Publication Date 9/14/2023 
Target
Name:
Interleukin-17F
Synonyms:
Cytokine ML-1 IL17F_HUMAN | il-17f
Type:
Enzyme Catalytic Domain
Mol. Mass.:
18053.35
Organism:
Homo sapiens (Human)
Description:
Q96PD4
Residue:
163
  
Inhibitor
Name:
BDBM617577
Synonyms:
US20230286943, Example 45
Type:
Small organic molecule
Emp. Form.:
C25H33N7O2
Mol. Mass.:
463.5752
SMILES:
CCn1nccc1C(=O)N[C@@H]([C@H]1CC[C@H](C)CC1)C(=O)Nc1ccc(cn1)-c1c(C)cnn1C
: