Target
Interleukin-17F
Ligand
BDBM617600
Substrate
Meas. Tech.
AlphaLISA Assay
IC50
79.4±n/a nM
Citation
 MARTIN, BPWESTERMANN, JKERN, OTHOLMES, AJMORRISON, AKICZUN, MAL MASRI, MSMITH, AHUXLEY, A IL-17A MODULATORS US Patent  US20230286943 Publication Date 9/14/2023 
Target
Name:
Interleukin-17F
Synonyms:
Cytokine ML-1 IL17F_HUMAN | il-17f
Type:
Enzyme Catalytic Domain
Mol. Mass.:
18053.35
Organism:
Homo sapiens (Human)
Description:
Q96PD4
Residue:
163
  
Inhibitor
Name:
BDBM617600
Synonyms:
US20230286943, Example 68
Type:
Small organic molecule
Emp. Form.:
C24H32N8O2
Mol. Mass.:
464.5633
SMILES:
CCn1nccc1C(=O)N[C@@H](C1CCCCCC1)C(=O)Nc1ccc(cn1)-c1c(C)nnn1C
: